{"text_format":"1","workbook":"xlsx","n_sheets":5,"sheets":["Instructions","Base Calc","Group 1","Summary D+C","Summary O+M"],"not_rendered":{"charts":0,"images":1,"macros":1,"external_links":0,"defined_names":10,"comments":3,"pivot_tables":0},"unopened":[],"bounds":{"document_bytes":16777216,"sheet_cells":100000,"rows_first":2000,"rows_last":500,"rows_between":2000,"halvings":0,"cell_chars":16384,"cell_head_chars":4096},"cells_cut":0,"cells_raw":0,"read":"whole","date_system":"1900"}

{"sheet":"Instructions","index":0,"n_rows":46,"n_cols":25,"rows_kept":46,"cut":false,"hidden":false,"merged":[[35,2,35,17],[30,2,30,4],[24,20,24,24],[31,2,31,4],[32,2,32,4],[24,13,24,17],[24,10,24,11],[24,6,24,9],[24,5,25,5],[25,6,25,7],[25,8,25,9],[24,2,25,4],[26,2,26,4],[27,2,27,4],[28,2,28,4],[29,2,29,4],[5,4,5,11],[2,4,2,11],[10,4,10,11],[6,4,6,11],[19,4,19,11],[15,4,15,11],[13,4,13,11],[9,4,9,9]]}
[]
[]
[null,null,null,null,"Indoor Water Use Reduction Calculator\nLEED v4 WE Prerequisite Indoor Water Use Reduction and WE Credit Indoor Water Use Reduction"]
[]
[null,null,null,null,"Step 1. "]
[null,null,null,null,"Enable macros."]
[null,null,null,null,"Note: This calculator is for use with Excel for Mac 2011 and Excel 2007 or later."]
[]
[null,null,null,null,"Step 2. "]
[null,null,null,null,"Unit of measurement",null,null,null,null,null,null,"IP units"]
[null,null,null,null,"Note: This selection must match the unit of measurement chosen during project registration."]
[]
[null,null,null,null,"Step 3. "]
[null,null,null,null,"Complete the Flush and/or Flow tables on the Group tab."]
[]
[null,null,null,null,"Note: Projects with extremely complex occupancy and/or fixture usage patterns (such as where different types of occupants have different annual days of operation and use fixtures with differing flush and flow rates within the building) may complete a separate calculator tab to represent the usage for complex scenarios. "]
[]
[]
[null,null,null,null,"Step 4. "]
[null,null,null,null,"Upload the completed spreadsheet to LEED Online.  Complete any related summary fields in the LEED credit form with the results of the calculator."]
{"$rows_left_out":27}
{"sheet":"Base Calc","index":1,"n_rows":64,"n_cols":31,"rows_kept":64,"cut":false,"hidden":true,"merged":[[4,1,4,8],[7,1,7,2],[8,1,8,2],[6,1,6,2],[10,1,10,7],[9,1,9,8],[6,24,7,24],[4,27,4,28],[4,29,4,30],[24,1,25,2],[51,1,52,2],[42,20,42,21],[42,23,43,23],[41,1,41,23],[8,24,9,24],[16,1,17,1],[16,6,17,6],[16,7,17,7],[19,2,19,5],[16,2,17,5],[18,2,18,5],[16,8,17,8],[55,1,55,23],[56,7,56,8],[56,10,56,11],[56,12,56,13],[56,14,56,15],[56,16,56,17],[56,18,56,19],[56,20,56,21],[56,23,57,23],[56,1,57,1],[56,5,56,6],[56,4,57,4],[56,3,57,3],[56,2,57,2],[47,2,47,4],[42,8,43,8],[42,2,43,4],[42,5,43,5],[12,1,12,7],[29,1,30,1],[42,1,43,1],[32,2,32,3],[33,2,33,3],[34,2,34,3],[35,2,35,3],[20,2,20,5],[29,2,30,3],[31,2,31,3],[29,4,30,4],[45,2,45,4],[46,2,46,4],[29,8,30,8],[29,5,29,6],[29,7,30,7],[29,23,30,23],[42,16,42,17],[42,18,42,19],[44,2,44,4],[42,6,42,7],[42,10,42,11],[42,12,42,13],[42,14,42,15],[11,1,11,8],[16,12,16,13],[28,1,28,23],[15,1,15,23],[29,10,29,11],[29,14,29,15],[29,16,29,17],[29,18,29,19],[29,20,29,21],[16,20,16,21],[16,23,17,23],[16,10,16,11],[29,12,29,13],[16,14,16,15],[16,16,16,17],[16,18,16,19]]}
[]
[null,{"$f":"REPLACE(CELL(\"filename\",A1),1,FIND(\"]\",CELL(\"filename\",A1)),\"\")","v":"Base Calc"}]
[]
[null,"Table 1. Project Information"]
[null,"Enter project occupancy information.  This information should be consistent with occupancy numbers used in other LEED credits.  The default gender mix is half male and half female.  If necessary, modify the Male and Female occupant type columns for non-default gender mix. ",null,null,null,null,null,null,null,null,null,null,null,null,null,null,null,null,null,null,null,null,null,null,null,null,null,"FLUSH",null,"FLOW"]
[null,null,null,"Employees\n (FTE)","Visitors","Retail Customers","Students\n(For Schools only)","Residential","Other (specify)",null,null,null,null,null,null,null,null,null,null,null,null,null,null,null,null,null,null,"ref # if included","ref list w/o blanks","ref # if included","ref list w/o blanks"]
[null,"Total",null,null,null,null,null,null,null,null,null,null,null,null,null,null,null,null,null,null,null,null,null,null,"Baseline","Flush",{"$f":"I22","v":0},{"$f":"IF(I19=\"Yes\",B19,\"\")","v":""},{"$f":"IFERROR(INDEX(AB7:AB9,SMALL((IF(LEN(AB7:AB9),ROW(INDIRECT(\"1:\"&ROWS(AB7:AB9))))),ROW(A1)),1),\"\")","v":""},{"$f":"IF(I45=\"Yes\",B45,\"\")","v":""},{"$f":"IFERROR(INDEX(AD7:AD10,SMALL((IF(LEN(AD7:AD10),ROW(INDIRECT(\"1:\"&ROWS(AD7:AD10))))),ROW(A1)),1),\"\")","v":""}]
[null,"Male",null,{"$f":"D7/2","v":0},0,0,0,0,0,null,null,null,null,null,null,null,null,null,null,null,null,null,null,null,null,"Flow",{"$f":"I49","v":0},{"$f":"IF(I20=\"Yes\",B20,\"\")","v":""},{"$f":"IFERROR(INDEX(AB7:AB9,SMALL((IF(LEN(AB7:AB9),ROW(INDIRECT(\"1:\"&ROWS(AB7:AB9))))),ROW(A2)),1),\"\")","v":""},{"$f":"IF(I46=\"Yes\",B46,\"\")","v":""},{"$f":"IFERROR(INDEX(AD7:AD10,SMALL((IF(LEN(AD7:AD10),ROW(INDIRECT(\"1:\"&ROWS(AD7:AD10))))),ROW(A2)),1),\"\")","v":""}]
[null,"Female",null,{"$f":"D7/2","v":0},0,0,0,0,0,null,null,null,null,null,null,null,null,null,null,null,null,null,null,null,"Design","Flush",{"$f":"I37","v":0},{"$f":"IF(I21=\"Yes\",B21,\"\")","v":""},{"$f":"IFERROR(INDEX(AB7:AB9,SMALL((IF(LEN(AB7:AB9),ROW(INDIRECT(\"1:\"&ROWS(AB7:AB9))))),ROW(A3)),1),\"\")","v":""},{"$f":"IF(I47=\"Yes\",B47,\"\")","v":""},{"$f":"IFERROR(INDEX(AD7:AD10,SMALL((IF(LEN(AD7:AD10),ROW(INDIRECT(\"1:\"&ROWS(AD7:AD10))))),ROW(A3)),1),\"\")","v":""}]
[null,"Determine the percent of males expected to use urinals (enter 100% if all male restrooms have urinals, 0% if the project contains no urinals, etc)",null,null,null,null,null,null,null,null,null,null,null,null,null,null,null,null,null,null,null,null,null,null,null,"Flow",{"$f":"I64","v":0},null,null,{"$f":"IF(I48=\"Yes\",B48,\"\")","v":""},{"$f":"IFERROR(INDEX(AD7:AD10,SMALL((IF(LEN(AD7:AD10),ROW(INDIRECT(\"1:\"&ROWS(AD7:AD10))))),ROW(A4)),1),\"\")","v":""}]
[null,"Percent of males expected to use restrooms with urinals ",null,null,null,null,null,null,1]
[null,"Enter the number of days the project is accessible to employees or FTE."]
[null,"Annual days of operation ",null,null,null,null,null,null,365]
[null,{"$f":"IF(I13>365,\"Annual days of operation must be between 1 and 365.\",\"\")","v":""}]
[null,"Table 2. Flush Fixtures Baseline Case"]
[null,"1. Indicate whether the Fixture Type is present on the project using the Included in Project column.\n2. If necessary, modify the Uses per Day column for non-default uses."]
[null,"Fixture Reference","Baseline Case Fixture Type",null,null,null,"Gender",{"$f":"IF(Instructions!U40=1,\"Default Flush Rate \n(gpf)\",\"Default Flush Rate \n(lpf)\")","v":"Default Flush Rate \n(gpf)"},"Included \nin Project",null,"Employees (FTE)",null,"Visitors",null,"Retail Customers",null,"Students",null,"Residential",null,{"$f":"IF($I$6=\"Other (please specify)\",\"Other\",$I$6)","v":"Other (specify)"},null,null,{"$f":"IF(Instructions!$U$40=1,\"Total Daily Water Use \n(gpf)\",\"Total Daily Water Use \n(lpf)\")","v":"Total Daily Water Use \n(gpf)"}]
[null,null,null,null,null,null,null,null,null,null,"Uses \nper Day",{"$f":"IF(Instructions!$U$40=1,\"Daily Water Use \n(gpf)\",\"Daily Water Use \n(lpf)\")","v":"Daily Water Use \n(gpf)"},"Uses \nper Day",{"$f":"IF(Instructions!$U$40=1,\"Daily Water Use \n(gpf)\",\"Daily Water Use \n(lpf)\")","v":"Daily Water Use \n(gpf)"},"Uses \nper Day",{"$f":"IF(Instructions!$U$40=1,\"Daily Water Use \n(gpf)\",\"Daily Water Use \n(lpf)\")","v":"Daily Water Use \n(gpf)"},"Uses \nper Day",{"$f":"IF(Instructions!$U$40=1,\"Daily Water Use \n(gpf)\",\"Daily Water Use \n(lpf)\")","v":"Daily Water Use \n(gpf)"},"Uses \nper Day",{"$f":"IF(Instructions!$U$40=1,\"Daily Water Use \n(gpf)\",\"Daily Water Use \n(lpf)\")","v":"Daily Water Use \n(gpf)"},"Uses \nper Day",{"$f":"IF(Instructions!$U$40=1,\"Daily Water Use \n(gpf)\",\"Daily Water Use \n(lpf)\")","v":"Daily Water Use \n(gpf)"}]
[null,"_1",{"$f":"Instructions!$C$27","v":"Toilet "},null,null,null,{"$f":"Instructions!$F$27","v":"Male"},{"$f":"IF(Instructions!$U$40=1,Instructions!$G$27,Instructions!$I$27)","v":1.6},null,null,{"$f":"Instructions!N27+((1-I11)*Instructions!N28)","v":1},{"$f":"H19*D8*K19","v":0},{"$f":"Instructions!O27+((1-I11)*Instructions!O28)","v":0.1},{"$f":"$H19*E8*M19","v":0},{"$f":"Instructions!P27+((1-I11)*Instructions!P28)","v":0.1},{"$f":"$H19*F8*O19","v":0},{"$f":"Instructions!Q27+((1-I11)*Instructions!Q28)","v":1},{"$f":"$H19*G8*Q19","v":0},{"$f":"Instructions!R27+((1-I11)*Instructions!R28)","v":5},{"$f":"$H19*H8*S19","v":0},null,{"$f":"$H19*I8*U19","v":0},null,{"$f":"IF(I19=\"Yes\",SUM(L19,R19,N19,P19,T19,V19),0)","v":0}]
[null,"_2",{"$f":"Instructions!$C$28","v":"Toilet "},null,null,null,{"$f":"Instructions!$F$28","v":"Female"},{"$f":"IF(Instructions!$U$40=1,Instructions!$G$28,Instructions!$I$28)","v":1.6},null,null,{"$f":"Instructions!$N$28","v":3},{"$f":"H20*D9*K20","v":0},{"$f":"Instructions!$O$28","v":0.5},{"$f":"$H20*E9*M20","v":0},{"$f":"Instructions!$P$28","v":0.2},{"$f":"$H20*F9*O20","v":0},{"$f":"Instructions!$Q$28","v":3},{"$f":"$H20*G9*Q20","v":0},{"$f":"Instructions!$R$28","v":5},{"$f":"$H20*H9*S20","v":0},null,{"$f":"$H20*I9*U20","v":0},null,{"$f":"IF(I20=\"Yes\",SUM(L20,R20,N20,P20,T20,V20),0)","v":0}]
{"$rows_left_out":45}
{"sheet":"Group 1","index":2,"n_rows":64,"n_cols":31,"rows_kept":64,"cut":false,"hidden":false,"merged":[[56,16,56,17],[56,18,56,19],[56,20,56,21],[56,23,57,23],[55,1,55,23],[56,1,57,1],[56,2,57,2],[56,3,57,3],[56,4,57,4],[56,5,56,6],[56,7,56,8],[56,10,56,11],[56,12,56,13],[56,14,56,15],[42,23,43,23],[44,2,44,4],[45,2,45,4],[46,2,46,4],[47,2,47,4],[42,18,42,19],[42,20,42,21],[51,1,52,2],[42,10,42,11],[42,12,42,13],[42,14,42,15],[42,16,42,17],[42,1,43,1],[42,2,43,4],[42,5,43,5],[42,6,42,7],[42,8,43,8],[32,2,32,3],[33,2,33,3],[34,2,34,3],[35,2,35,3],[41,1,41,23],[31,2,31,3],[24,1,25,2],[28,1,28,23],[29,1,30,1],[29,2,30,3],[29,4,30,4],[29,5,29,6],[29,7,30,7],[29,8,30,8],[29,10,29,11],[29,12,29,13],[29,14,29,15],[29,16,29,17],[29,18,29,19],[29,20,29,21],[29,23,30,23],[20,2,20,5],[15,1,15,23],[16,1,17,1],[16,2,17,5],[16,6,17,6],[16,7,17,7],[16,8,17,8],[16,10,16,11],[16,12,16,13],[16,14,16,15],[16,16,16,17],[16,18,16,19],[16,20,16,21],[16,23,17,23],[18,2,18,5],[19,2,19,5],[12,1,12,7],[4,1,4,8],[4,27,4,28],[4,29,4,30],[6,1,6,2],[6,24,7,24],[7,1,7,2],[8,1,8,2],[8,24,9,24],[9,1,9,8],[10,1,10,7],[11,1,11,8]]}
[]
[null,{"$f":"REPLACE(CELL(\"filename\",A1),1,FIND(\"]\",CELL(\"filename\",A1)),\"\")","v":"Group 1"}]
[]
[null,"Table 1. Project Information"]
[null,"Enter project occupancy information.  This information should be consistent with occupancy numbers used in other LEED credits.  The default gender mix is half male and half female.  If necessary, modify the Male and Female occupant type columns for non-default gender mix. ",null,null,null,null,null,null,null,null,null,null,null,null,null,null,null,null,null,null,null,null,null,null,null,null,null,"FLUSH",null,"FLOW"]
[null,null,null,"Employees\n (FTE)","Visitors","Retail Customers","Students\n(For Schools only)","Residential","Other (specify)",null,null,null,null,null,null,null,null,null,null,null,null,null,null,null,null,null,null,"ref # if included","ref list w/o blanks","ref # if included","ref list w/o blanks"]
[null,"Total",null,35,10,0,0,0,null,null,null,null,null,null,null,null,null,null,null,null,null,null,null,null,"Baseline","Flush",{"$f":"I22","v":39816},{"$f":"IF(I19=\"Yes\",B19,\"\")","v":"_1"},{"$f":"IFERROR(INDEX(AB7:AB9,SMALL((IF(LEN(AB7:AB9),ROW(INDIRECT(\"1:\"&ROWS(AB7:AB9))))),ROW(A1)),1),\"\")","v":"_1"},{"$f":"IF(I45=\"Yes\",B45,\"\")","v":"_A"},{"$f":"IFERROR(INDEX(AD7:AD10,SMALL((IF(LEN(AD7:AD10),ROW(INDIRECT(\"1:\"&ROWS(AD7:AD10))))),ROW(A1)),1),\"\")","v":"_A"}]
[null,"Male",null,{"$f":"D7/2","v":18},{"$f":"E7/2","v":5},0,0,0,0,null,null,null,null,null,null,null,null,null,null,null,null,null,null,null,null,"Flow",{"$f":"I49","v":22806},{"$f":"IF(I20=\"Yes\",B20,\"\")","v":"_2"},{"$f":"IFERROR(INDEX(AB7:AB9,SMALL((IF(LEN(AB7:AB9),ROW(INDIRECT(\"1:\"&ROWS(AB7:AB9))))),ROW(A2)),1),\"\")","v":"_2"},{"$f":"IF(I46=\"Yes\",B46,\"\")","v":""},{"$f":"IFERROR(INDEX(AD7:AD10,SMALL((IF(LEN(AD7:AD10),ROW(INDIRECT(\"1:\"&ROWS(AD7:AD10))))),ROW(A2)),1),\"\")","v":"_C"}]
[null,"Female",null,{"$f":"D7/2","v":18},5,0,0,0,0,null,null,null,null,null,null,null,null,null,null,null,null,null,null,null,"Design","Flush",{"$f":"I37","v":20225.52},{"$f":"IF(I21=\"Yes\",B21,\"\")","v":"_3"},{"$f":"IFERROR(INDEX(AB7:AB9,SMALL((IF(LEN(AB7:AB9),ROW(INDIRECT(\"1:\"&ROWS(AB7:AB9))))),ROW(A3)),1),\"\")","v":"_3"},{"$f":"IF(I47=\"Yes\",B47,\"\")","v":"_C"},{"$f":"IFERROR(INDEX(AD7:AD10,SMALL((IF(LEN(AD7:AD10),ROW(INDIRECT(\"1:\"&ROWS(AD7:AD10))))),ROW(A3)),1),\"\")","v":"_D"}]
[null,"Determine the percent of males expected to use urinals (enter 100% if all male restrooms have urinals, 0% if the project contains no urinals, etc)",null,null,null,null,null,null,null,null,null,null,null,null,null,null,null,null,null,null,null,null,null,null,null,"Flow",{"$f":"I64","v":22806},null,null,{"$f":"IF(I48=\"Yes\",B48,\"\")","v":"_D"},{"$f":"IFERROR(INDEX(AD7:AD10,SMALL((IF(LEN(AD7:AD10),ROW(INDIRECT(\"1:\"&ROWS(AD7:AD10))))),ROW(A4)),1),\"\")","v":""}]
[null,"Percent of males expected to use restrooms with urinals ",null,null,null,null,null,null,1]
[null,"Enter the number of days the project is accessible to employees or FTE."]
[null,"Annual days of operation ",null,null,null,null,null,null,252]
[null,{"$f":"IF(I13>365,\"Annual days of operation must be between 1 and 365.\",\"\")","v":""}]
[null,"Table 2. Flush Fixtures Baseline Case"]
[null,"1. Indicate whether the Fixture Type is present on the project using the Included in Project column.\n2. If necessary, modify the Uses per Day column for non-default uses."]
[null,"Fixture Reference","Baseline Case Fixture Type",null,null,null,"Gender",{"$f":"IF(Instructions!U40=1,\"Default Flush Rate \n(gpf)\",\"Default Flush Rate \n(lpf)\")","v":"Default Flush Rate \n(gpf)"},"Included \nin Project",null,"Employees (FTE)",null,"Visitors",null,"Retail Customers",null,"Students",null,"Residential",null,{"$f":"IF($I$6=\"Other (please specify)\",\"Other\",$I$6)","v":"Other (specify)"},null,null,{"$f":"IF(Instructions!$U$40=1,\"Total Daily Water Use \n(gpf)\",\"Total Daily Water Use \n(lpf)\")","v":"Total Daily Water Use \n(gpf)"}]
[null,null,null,null,null,null,null,null,null,null,"Uses \nper Day",{"$f":"IF(Instructions!$U$40=1,\"Daily Water Use \n(gpf)\",\"Daily Water Use \n(lpf)\")","v":"Daily Water Use \n(gpf)"},"Uses \nper Day",{"$f":"IF(Instructions!$U$40=1,\"Daily Water Use \n(gpf)\",\"Daily Water Use \n(lpf)\")","v":"Daily Water Use \n(gpf)"},"Uses \nper Day",{"$f":"IF(Instructions!$U$40=1,\"Daily Water Use \n(gpf)\",\"Daily Water Use \n(lpf)\")","v":"Daily Water Use \n(gpf)"},"Uses \nper Day",{"$f":"IF(Instructions!$U$40=1,\"Daily Water Use \n(gpf)\",\"Daily Water Use \n(lpf)\")","v":"Daily Water Use \n(gpf)"},"Uses \nper Day",{"$f":"IF(Instructions!$U$40=1,\"Daily Water Use \n(gpf)\",\"Daily Water Use \n(lpf)\")","v":"Daily Water Use \n(gpf)"},"Uses \nper Day",{"$f":"IF(Instructions!$U$40=1,\"Daily Water Use \n(gpf)\",\"Daily Water Use \n(lpf)\")","v":"Daily Water Use \n(gpf)"}]
[null,"_1",{"$f":"Instructions!$C$27","v":"Toilet "},null,null,null,{"$f":"Instructions!$F$27","v":"Male"},{"$f":"IF(Instructions!$U$40=1,Instructions!$G$27,Instructions!$I$27)","v":1.6},"Yes",null,{"$f":"Instructions!N27+((1-I11)*Instructions!N28)","v":1},{"$f":"H19*D8*K19","v":28.8},{"$f":"Instructions!O27+((1-I11)*Instructions!O28)","v":0.1},{"$f":"$H19*E8*M19","v":0.8},{"$f":"Instructions!P27+((1-I11)*Instructions!P28)","v":0.1},{"$f":"$H19*F8*O19","v":0},{"$f":"Instructions!Q27+((1-I11)*Instructions!Q28)","v":1},{"$f":"$H19*G8*Q19","v":0},{"$f":"Instructions!R27+((1-I11)*Instructions!R28)","v":5},{"$f":"$H19*H8*S19","v":0},null,{"$f":"$H19*I8*U19","v":0},null,{"$f":"IF(I19=\"Yes\",SUM(L19,R19,N19,P19,T19,V19),0)","v":29.6}]
[null,"_2",{"$f":"Instructions!$C$28","v":"Toilet "},null,null,null,{"$f":"Instructions!$F$28","v":"Female"},{"$f":"IF(Instructions!$U$40=1,Instructions!$G$28,Instructions!$I$28)","v":1.6},"Yes",null,{"$f":"Instructions!$N$28","v":3},{"$f":"H20*D9*K20","v":86.4},{"$f":"Instructions!$O$28","v":0.5},{"$f":"$H20*E9*M20","v":4},{"$f":"Instructions!$P$28","v":0.2},{"$f":"$H20*F9*O20","v":0},{"$f":"Instructions!$Q$28","v":3},{"$f":"$H20*G9*Q20","v":0},{"$f":"Instructions!$R$28","v":5},{"$f":"$H20*H9*S20","v":0},null,{"$f":"$H20*I9*U20","v":0},null,{"$f":"IF(I20=\"Yes\",SUM(L20,R20,N20,P20,T20,V20),0)","v":90.4}]
{"$rows_left_out":45}
{"sheet":"Summary D+C","index":3,"n_rows":20,"n_cols":13,"rows_kept":20,"cut":false,"hidden":false,"merged":[[14,3,14,11],[7,4,9,4],[7,5,7,8],[7,9,7,12],[8,5,8,8],[8,9,8,12],[7,3,9,3],[12,3,12,11],[13,3,13,11]]}
[]
[null,null,1]
[null,null,1,"Summary for Design and Construction Rating Systems"]
[null,null,1,"Note: Baseline and design volumes are READ-ONLY. To edit, see the previous tab(s). "]
[null,null,1]
[null,null,1]
[null,null,1]
[null,null,1,"Group Name","Percent Occupants using\nGroup\n(%)","Baseline Case",null,null,null,"Design Case"]
[null,null,null,null,null,{"$f":"IF(Instructions!U40=1,\"(gallons/year)\",\"(liters/year)\")","v":"(gallons/year)"},null,null,null,{"$f":"IF(Instructions!U40=1,\"(gallons/year)\",\"(liters/year)\")","v":"(gallons/year)"}]
[null,null,1,null,null,"Annual \nFlush \nVolume","Annual \nFlow \nVolume","Annual Baseline Consumption","Total\nBaseline Consumption","Annual \nFlush \nVolume","Annual \nFlow \nVolume","Annual Design\nConsumption","Total\nDesign Consumption"]
[null,null,{"$f":"IF(OR(D11=\"Introduction\",D11=\"Base Calc\",D11=\"Summary D+C\",D11=\"Summary O+M\",D11=\"\",D11=0),0,1)","v":1},{"$f":"IFERROR(INDEX(MID(Sheets,FIND(\"]\",Sheets)+1,255),ROW(A3),1),\"\")","v":"Group 1"},null,{"$f":"INDIRECT(\"'\"&D11&\"'!$AA$7\")","v":39816},{"$f":"INDIRECT(\"'\"&$D11&\"'!$AA$8\")","v":22806},{"$f":"F11+G11","v":62622},{"$f":"H11*E11","v":0},{"$f":"INDIRECT(\"'\"&$D11&\"'!$AA$9\")","v":20225.52},{"$f":"INDIRECT(\"'\"&$D11&\"'!$AA$10\")","v":22806},{"$f":"J11+K11","v":43031.519999999997},{"$f":"L11*E11","v":0}]
[null,null,1]
[null,"A",1,{"$f":"IF(Instructions!U40=1,\"Annual baseline water consumption (gallons/year)\",\"Annual baseline water consumption (liters/year)\")","v":"Annual baseline water consumption (gallons/year)"},null,null,null,null,null,null,null,null,{"$f":"SUM(I11:I12)","v":0}]
[null,null,1,{"$f":"IF(Instructions!U40=1,\"Annual design water consumption (gallons/year)\",\"Annual design water consumption (liters/year)\")","v":"Annual design water consumption (gallons/year)"},null,null,null,null,null,null,null,null,{"$f":"SUM(M11:M12)","v":0}]
[null,null,1,"Percent reduction from baseline (%)",null,null,null,null,null,null,null,null,{"$f":"IF(M14=0,0,(M13-M14)/M13)","v":0}]
[null,null,1]
[]
[]
[]
[null,null,null,null,null,null,{"$f":"IFERROR(INDEX(MID(Sheets,FIND(\"]\",Sheets)+1,255),ROW(#REF!),1),\"\")","v":""}]
{"$rows_left_out":1}
{"sheet":"Summary O+M","index":4,"n_rows":28,"n_cols":13,"rows_kept":28,"cut":false,"hidden":false,"merged":[[6,7,6,12],[22,3,22,11],[13,3,15,3],[13,4,15,4],[13,5,13,8],[13,9,13,12],[14,5,14,8],[14,9,14,12],[18,3,18,11],[19,3,19,11],[20,3,20,11],[21,3,21,11]]}
[]
[null,null,1]
[null,null,1,"Summary for Operations and Maintenance Rating Systems"]
[null,null,1,"Note: Baseline and design volumes are READ-ONLY. To edit, see the previous tab(s). "]
[null,null,1]
[null,null,1]
[null,null,1,"Unrenovated percentage of fixtures installed before 1995",null,null,0,{"$f":"IF(AND(SUM(F7:F9)>0,SUM(F7:F9)<1),\"ERROR: The total percentage of fixtures installed must equal 100.\",\"\")","v":""}]
[null,null,1]
[null,null,1,"Renovated percentage of fixtures installed in 1995 or later",null,null,1]
[null,null,1]
[null,null,1]
[null,null,1]
[null,null,1]
[null,null,1,"Group Name","Percent Occupants using \nGroup\n(%)","Baseline Case",null,null,null,"Design Case"]
[null,null,null,null,null,{"$f":"IF(Instructions!U40=1,\"(gallons/year)\",\"(liters/year)\")","v":"(gallons/year)"},null,null,null,{"$f":"IF(Instructions!U40=1,\"(gallons/year)\",\"(liters/year)\")","v":"(gallons/year)"}]
[null,null,1,null,null,"Annual \nFlush Volume","Annual \nFlow \nVolume","Annual Baseline Consumption","Total\nBaseline Consumption","Annual \nFlush \nVolume","Annual \nFlow \nVolume","Annual Design\nConsumption","Total\nDesign Consumption"]
[null,null,{"$f":"IF(OR(D17=\"Introduction\",D17=\"Base Calc\",D17=\"Summary D+C\",D17=\"Summary O+M\",D17=\"\",D17=0),0,1)","v":1},{"$f":"IFERROR(INDEX(MID(Sheets,FIND(\"]\",Sheets)+1,255),ROW(A3),1),\"\")","v":"Group 1"},1,{"$f":"INDIRECT(\"'\"&D17&\"'!$AA$7\")","v":39816},{"$f":"INDIRECT(\"'\"&$D17&\"'!$AA$8\")","v":22806},{"$f":"F17+G17","v":62622},{"$f":"H17*E17","v":62622},{"$f":"INDIRECT(\"'\"&$D17&\"'!$AA$9\")","v":20225.52},{"$f":"INDIRECT(\"'\"&$D17&\"'!$AA$10\")","v":22806},{"$f":"J17+K17","v":43031.519999999997},{"$f":"L17*E17","v":43031.519999999997}]
[null,null,1]
[null,"A",1,{"$f":"IF(Instructions!U40=1,\"Annual baseline water consumption (gallons/year)\",\"Annual baseline water consumption (liters/year)\")","v":"Annual baseline water consumption (gallons/year)"},null,null,null,null,null,null,null,null,{"$f":"SUM(I17:I18)","v":62622}]
[null,null,1,{"$f":"IF(Instructions!U40=1,\"Annual design water consumption (gallons/year)\",\"Annual design water consumption (liters/year)\")","v":"Annual design water consumption (gallons/year)"},null,null,null,null,null,null,null,null,{"$f":"SUM(M17:M18)","v":43031.519999999997}]
{"$rows_left_out":8}